*Heading
*Preprint, echo=NO, model=NO, history=NO, contact=NO
**
** bar dimensions: 10X1X1: Loading along x
**
*Node
*Element, type=C3D8
*Nset, nset=All, generate
*Elset, elset=All
**
*Nset, nset=FIX
*Nset, nset=X1C
**
*Solid Section, elset=All, material=Material
**
** MATERIALS
**
*Material, name=Material
*Density
 7.86e-09,
*Depvar
*User Material, Constants=40, Unsymm
**
** BOUNDARY CONDITIONS
**
*EQUATION
**
** OTHER BOUNDARY CONDITIONS
**
** Name: FIX Type: Displacement/Rotation
*Boundary
FIX, 1, 1
FIX, 2, 2
FIX, 3, 3
** ----------------------------------------------------------------
**
** STEP: Load_Static
**
*Step, name=Load_Static, nlgeom=YES, inc=100000
*Static
0.001, 1.5, 1e-05, 0.01
**
** BOUNDARY CONDITIONS
**
** Name: X-Vel_1 Type: Velocity/Angular velocity
*Boundary, type=VELOCITY
X1C, 1, 1, 1.5
**
** OUTPUT REQUESTS
**
*Restart, write, frequency=0
**
**
** FIELD OUTPUT
**
*Output, field, Frequency=1
*Node Output, Nset=X1C
RF, U
**
*End Step