*Heading
** Job name: PS_2_new Model name: PS_2
** Generated by: Abaqus/CAE 6.10-EF2
*Preprint, echo=NO, model=NO, history=NO, contact=NO
**
** PARTS
**
*Part, name=PART-10
*Node
*Element, type=C3D8
*Elset, elset=_PICKEDSET2, internal, generate
** Section: Section-1-_PICKEDSET2
*Solid Section, elset=_PICKEDSET2, material=MATERIAL-1
*End Part
**
**
** ASSEMBLY
**
*Assembly, name=Assembly
**
*Instance, name=PART-10-1, part=PART-10
*End Instance
**
*Nset, nset=_PICKEDSET34, internal, instance=PART-10-1
*Nset, nset=_PICKEDSET35, internal, instance=PART-10-1
*Nset, nset=_PICKEDSET36, internal, instance=PART-10-1
*Nset, nset=_PICKEDSET37, internal, instance=PART-10-1
*End Assembly
*Amplitude, name=AMP-1
          0.,           0.,       0.0001,  6.16838e-05,       0.0002,   0.00024672,       0.0003,  0.000555063
      0.0004,  0.000986636,       0.0005,  0.001541333,       0.0006,  0.002219018,       0.0007,  0.003019522
      0.0008,  0.003942649,       0.0009,  0.004988171,        0.001,   0.00615583,       0.0011,  0.007445337
      0.0012,  0.008856375,       0.0013,  0.010388595,       0.0014,  0.012041619,       0.0015,   0.01381504
      0.0016,  0.015708419,       0.0017,  0.017721291,       0.0018,  0.019853157,       0.0019,  0.022103493
       0.002,  0.024471742,       0.0021,  0.026957321,       0.0022,  0.029559616,       0.0023,  0.032277985
      0.0024,  0.035111757,       0.0025,  0.038060234,       0.0026,  0.041122687,       0.0027,  0.044298362
      0.0028,  0.047586474,       0.0029,  0.050986212,        0.003,  0.054496738,       0.0031,  0.058117185
*Amplitude, name=Amp-2
          0.,           0.,        5e-05,  6.16838e-05,       0.0001,   0.00024672,      0.00015,  0.000555063
      0.0002,  0.000986636,      0.00025,  0.001541333,       0.0003,  0.002219018,      0.00035,  0.003019522
      0.0004,  0.003942649,      0.00045,  0.004988171,       0.0005,   0.00615583,      0.00055,  0.007445337
      0.0006,  0.008856375,      0.00065,  0.010388595,       0.0007,  0.012041619,      0.00075,   0.01381504
      0.0008,  0.015708419,      0.00085,  0.017721291,       0.0009,  0.019853157,      0.00095,  0.022103493
       0.001,  0.024471742,      0.00105,  0.026957321,       0.0011,  0.029559616,      0.00115,  0.032277985
      0.0012,  0.035111757,      0.00125,  0.038060234,       0.0013,  0.041122687,      0.00135,  0.044298362
      0.0014,  0.047586474,      0.00145,  0.050986212,       0.0015,  0.054496738,      0.00155,  0.058117185
*Amplitude, name=Amp-3
          0.,           0.,        0.002,  6.16838e-05,        0.004,   0.00024672,        0.006,  0.000555063
       0.008,  0.000986636,         0.01,  0.001541333,        0.012,  0.002219018,        0.014,  0.003019522
       0.016,  0.003942649,        0.018,  0.004988171,         0.02,   0.00615583,        0.022,  0.007445337
       0.024,  0.008856375,        0.026,  0.010388595,        0.028,  0.012041619,         0.03,   0.01381504
       0.032,  0.015708419,        0.034,  0.017721291,        0.036,  0.019853157,        0.038,  0.022103493
        0.04,  0.024471742,        0.042,  0.026957321,        0.044,  0.029559616,        0.046,  0.032277985
       0.048,  0.035111757,         0.05,  0.038060234,        0.052,  0.041122687,        0.054,  0.044298362
       0.056,  0.047586474,        0.058,  0.050986212,         0.06,  0.054496738,        0.062,  0.058117185
*Amplitude, name=Amp-4
          0.,           0.,        0.003,  6.16838e-05,        0.006,   0.00024672,        0.009,  0.000555063
       0.012,  0.000986636,        0.015,  0.001541333,        0.018,  0.002219018,        0.021,  0.003019522
       0.024,  0.003942649,        0.027,  0.004988171,         0.03,   0.00615583,        0.033,  0.007445337
       0.036,  0.008856375,        0.039,  0.010388595,        0.042,  0.012041619,        0.045,   0.01381504
       0.048,  0.015708419,        0.051,  0.017721291,        0.054,  0.019853157,        0.057,  0.022103493
        0.06,  0.024471742,        0.063,  0.026957321,        0.066,  0.029559616,        0.069,  0.032277985
       0.072,  0.035111757,        0.075,  0.038060234,        0.078,  0.041122687,        0.081,  0.044298362
       0.084,  0.047586474,        0.087,  0.050986212,         0.09,  0.054496738,        0.093,  0.058117185
**
** MATERIALS
**
*Material, name=MATERIAL-1
*Density
 7.86e-09,
*Depvar, delete=16
*User Material, constants=10
** ----------------------------------------------------------------
**
** STEP: Step-1
**
*Step, name=Step-1
*Dynamic, Explicit
, 0.4
*Bulk Viscosity
**
** BOUNDARY CONDITIONS
**
** Name: Disp-BC-1 Type: Displacement/Rotation
*Boundary
_PICKEDSET34, 1, 1
** Name: Disp-BC-2 Type: Displacement/Rotation
*Boundary
_PICKEDSET34, 2, 2
** Name: Disp-BC-3 Type: Displacement/Rotation
*Boundary
_PICKEDSET35, 1, 1
** Name: Disp-BC-4 Type: Displacement/Rotation
*Boundary, amplitude=Amp-3
_PICKEDSET36, 2, 2, 2.7
** Name: Disp-BC-5 Type: Displacement/Rotation
*Boundary
_PICKEDSET37, 3, 3
**
** OUTPUT REQUESTS
**
*Restart, write, number interval=1, time marks=NO
**
** FIELD OUTPUT: F-Output-1
**
*Output, field, number interval=40
*Node Output
A, RF, U, V
**
** FIELD OUTPUT: F-Output-2
**
*Contact Output
CSTRESS,
**
** FIELD OUTPUT: F-Output-3
**
*Element Output, directions=YES
EVF, LE, PE, PEEQ, PEEQVAVG, PEVAVG, S, SDV, STATUS, SVAVG, TRIAX
**
** HISTORY OUTPUT: H-Output-1
**
*Output, history, variable=PRESELECT
*End Step